Reaction Details
TargetFarnesyl pyrophosphate synthase
LigandBDBM12576
Substrate/Competitorn/a
Meas. Tech.ChEMBL_1795608 (CHEMBL4267725)
IC50 70±n/a nM
Citation Savino, SToscano, APurgatorio, RProfilo, ELaghezza, ATortorella, PAngelelli, MCellamare, SScala, RTricarico, DMarobbio, CMTPerna, FVitale, PAgamennone, MDimiccoli, VTolomeo, AScilimati, A Novel bisphosphonates with antiresorptive effect in bone mineralization and osteoclastogenesis. Eur J Med Chem158:184-200 (2018) 
 
Farnesyl pyrophosphate synthase
Name:Farnesyl pyrophosphate synthase
Type:Enzyme
Mol. Mass.:48272.89
Organism:Homo sapiens (Human)
Description:P14324
Residue:419
BDBM12576
NameBDBM12576
Synonyms:Bisphosphonate 1 JMC515594 Compound 64 Risdronate [1-hydroxy-1-phosphono-2-(pyridin-3-yl)ethyl]phosphonic acid
TypeSmall organic molecule
Emp. Form.C7H11NO7P2
Mol. Mass.283.1123
SMILESOC(Cc1cccnc1)(P(O)(O)=O)P(O)(O)=O