Reaction Details
TargetDopamine beta-hydroxylase
LigandBDBM50026182
Substrate/Competitorn/a
Meas. Tech.ChEBML_59141
Ki 21000±n/a nM
Citation Bargar, TMBroersma, RJCreemer, LCMcCarthy, JRHornsperger, JMPalfreyman, MGWagner, JJung, MJ Unsaturated heterocyclic amines as potent time-dependent inhibitors of dopamine beta-hydroxylase. J Med Chem29:315-7 (1986) Dopamine beta-hydroxylase
Name:Dopamine beta-hydroxylase
Type:PROTEIN
Mol. Mass.:68136.39
Organism:Bos taurus
Description:ChEMBL_50738
Residue:610
BDBM50026182
NameBDBM50026182
Synonyms:3-Phenyl-prop-2-ynylamine US9161922, Table 1, Compound 3
TypeSmall organic molecule
Emp. Form.C9H9N
Mol. Mass.131.1745
SMILESNCC#Cc1ccccc1