Reaction Details
TargetTyrosine-protein kinase ABL1
LigandBDBM50468201
Substrate/Competitorn/a
Meas. Tech.ChEMBL_1798384 (CHEMBL4270676)
IC50 2500±n/a nM
Citation ?ezní?ková, ETenora, LPospí?ilová, PGaleta, JJorda, RBerka, KMajer, PPotá?ek, MKry?tof, V ALK5 kinase inhibitory activity and synthesis of 2,3,4-substituted 5,5-dimethyl-5,6-dihydro-4H-pyrrolo[1,2-b]pyrazoles. Eur J Med Chem127:632-642 (2017) 
 
Tyrosine-protein kinase ABL1
Name:Tyrosine-protein kinase ABL1
Type:PROTEIN
Mol. Mass.:122698.35
Organism:Mus musculus
Description:ChEMBL_767349
Residue:1123
BDBM50468201
NameBDBM50468201
Synonyms:CHEMBL4292491
TypeSmall organic molecule
Emp. Form.C25H26N6O2S
Mol. Mass.474.578
SMILESCc1cccc(n1)-c1nn2CC(C)(C)Cc2c1-c1ccnc(Nc2ccc(cc2)S(N)(=O)=O)c1