Reaction Details
TargetDihydrofolate reductase
LigandBDBM50008294
Substrate/Competitorn/a
Meas. Tech.ChEMBL_54592 (CHEMBL667315)
Ki 14±n/a nM
Citation Jones, TRCalvert, AHJackman, ALEakin, MASmithers, MJBetteridge, RFNewell, DRHayter, AJStocker, AHarland, SJ Quinazoline antifolates inhibiting thymidylate synthase: variation of the N10 substituent. J Med Chem28:1468-76 (1985) Dihydrofolate reductase
Name:Dihydrofolate reductase
Type:Enzyme
Mol. Mass.:21608.82
Organism:Mus musculus (Mouse)
Description:n/a
Residue:187
BDBM50008294
NameBDBM50008294
Synonyms:2-(4-(((2-amino-4-oxo-1,4-dihydroquinazolin-6-yl)methyl)(prop-2-ynyl)amino)benzamido)pentanedioic acid 2-{4-[(2-Amino-4-oxo-3,4-dihydro-quinazolin-6-ylmethyl)-prop-2-ynyl-amino]-benzoylamino}-pentanedioic acid 2-{4-[(2-Amino-4-oxo-3,4-dihydro-quinazolin-6-ylmethyl)-prop-2-ynyl-amino]-benzoylamino}-pentanedioic acid(N10-propargyl-5,8-dideazafolate, PDDF) CHEMBL422395 | PDDF
TypeSmall organic molecule
Emp. Form.C24H23N5O6
Mol. Mass.477.4693
SMILESNc1nc2ccc(CN(CC#C)c3ccc(cc3)C(=O)NC(CCC(O)=O)C(O)=O)cc2c(=O)[nH]1