Reaction Details
TargetThymidylate synthase
LigandBDBM50008294
Substrate/Competitorn/a
Meas. Tech.ChEBML_209955
Ki 4.5±n/a nM
Citation Jones, TRCalvert, AHJackman, ALEakin, MASmithers, MJBetteridge, RFNewell, DRHayter, AJStocker, AHarland, SJ Quinazoline antifolates inhibiting thymidylate synthase: variation of the N10 substituent. J Med Chem28:1468-76 (1985) Thymidylate synthase
Name:Thymidylate synthase
Type:PROTEIN
Mol. Mass.:34957.15
Organism:Mus musculus
Description:ChEMBL_1340097
Residue:307
BDBM50008294
NameBDBM50008294
Synonyms:2-(4-(((2-amino-4-oxo-1,4-dihydroquinazolin-6-yl)methyl)(prop-2-ynyl)amino)benzamido)pentanedioic acid 2-{4-[(2-Amino-4-oxo-3,4-dihydro-quinazolin-6-ylmethyl)-prop-2-ynyl-amino]-benzoylamino}-pentanedioic acid 2-{4-[(2-Amino-4-oxo-3,4-dihydro-quinazolin-6-ylmethyl)-prop-2-ynyl-amino]-benzoylamino}-pentanedioic acid(N10-propargyl-5,8-dideazafolate, PDDF) CHEMBL422395 | PDDF
TypeSmall organic molecule
Emp. Form.C24H23N5O6
Mol. Mass.477.4693
SMILESNc1nc2ccc(CN(CC#C)c3ccc(cc3)C(=O)NC(CCC(O)=O)C(O)=O)cc2c(=O)[nH]1