Reaction Details
TargetGlycylpeptide N-tetradecanoyltransferase 1/2
LigandBDBM50034993
Substrate/Competitorn/a
Meas. Tech.ChEMBL_141180 (CHEMBL750677)
Ki 31±n/a nM
Citation Devadas, BZupec, MEFreeman, SKBrown, DLNagarajan, SSikorski, JAMcWherter, CAGetman, DPGordon, JI Design and syntheses of potent and selective dipeptide inhibitors of Candida albicans myristoyl-CoA:protein N-myristoyltransferase. J Med Chem38:1837-40 (1995) 
 
Glycylpeptide N-tetradecanoyltransferase 1/2
Name:Glycylpeptide N-tetradecanoyltransferase 1/2
Synonyms:Peptide N-myristoyltransferase
Type:n/a
Mol. Mass.:n/a
Description:ASSAY_ID of ChEMBL is 141178
Components:This complex has 2 components.
Component 1
Name:Glycylpeptide N-tetradecanoyltransferase 2
Type:PROTEIN
Mol. Mass.:56986.61
Organism:Homo sapiens (Human)
Description:ChEMBL_1435042
Residue:498
Component 2
Name:Glycylpeptide N-tetradecanoyltransferase 1
Synonyms:Myristoyl-CoA:protein N-myristoyltransferase (Nmt) NMT NMT1_HUMAN Peptide N-myristoyltransferase 1
Type:Enzyme
Mol. Mass.:56814.10
Organism:Homo sapiens (Human)
Description:P30419
Residue:496
BDBM50034993
NameBDBM50034993
Synonyms:(S)-6-Amino-2-[(S)-3-hydroxy-2-(2-{4-[4-(2-methyl-imidazol-1-yl)-butyl]-phenyl}-acetylamino)-propionylamino]-hexanoic acid (2-cyclohexyl-ethyl)-amide SC-58272 | [CYCLOHEXYLETHYL]-[[[[4-[2-METHYL-1-IMIDAZOLYL-BUTYL]PHENYL]ACETYL]-SERYL]-LYSINYL]-AMINE
TypeSmall organic molecule
Emp. Form.C33H52N6O4
Mol. Mass.596.8038
SMILESCc1nccn1CCCCc1ccc(CC(=O)N[C@@H](CO)C(=O)N[C@@H](CCCCN)C(=O)NCCC2CCCCC2)cc1