Reaction Details
TargetReverse transcriptase/RNaseH
LigandBDBM2483
Substrate/Competitorn/a
Meas. Tech.ChEMBL_195344 (CHEMBL802586)
IC50 22.2±n/a nM
Citation Rodríguez-Barrios, FPérez, CLobatón, EVelázquez, SChamorro, CSan-Félix, APérez-Pérez, MJCamarasa, MJPelemans, HBalzarini, JGago, F Identification of a putative binding site for [2',5'-bis-O-(tert-butyldimethylsilyl)-beta-D-ribofuranosyl]-3'-spiro-5''-(4''-amino-1'',2''-oxathiole-2'',2''-dioxide)thymine (TSAO) derivatives at the p51-p66 interface of HIV-1 reverse transcriptase. J Med Chem44:1853-65 (2001) 
 
Reverse transcriptase/RNaseH
Name:Reverse transcriptase/RNaseH
Type:PROTEIN
Mol. Mass.:65229.15
Organism:Human immunodeficiency virus 1
Description:ChEMBL_1473730
Residue:566
BDBM2483
NameBDBM2483
Synonyms:(4S)-6-chloro-4-(2-cyclopropylethynyl)-4-(trifluoromethyl)-2,4-dihydro-1H-3,1-benzoxazin-2-one DMP-266 Efavirenz L-743,726 | Sustiva
TypeSmall organic molecule
Emp. Form.C14H9ClF3NO2
Mol. Mass.315.675
SMILESFC(F)(F)[C@]1(OC(=O)Nc2ccc(Cl)cc12)C#CC1CC1