Reaction Details
TargetNeuronal acetylcholine receptor subunit alpha-4/beta-2
LigandBDBM50106345
Substrate/Competitorn/a
Meas. Tech.ChEMBL_144341 (CHEMBL750233)
Ki>10000±n/a nM
Citation Romanelli, MNManetti, DScapecchi, SBorea, PADei, SBartolini, AGhelardini, CGualtieri, FGuandalini, LVarani, K Structure-affinity relationships of a unique nicotinic ligand: N(1)-dimethyl-N(4)-phenylpiperazinium iodide (DMPP). J Med Chem44:3946-55 (2001) 
 
Neuronal acetylcholine receptor subunit alpha-4/beta-2
Name:Neuronal acetylcholine receptor subunit alpha-4/beta-2
Type:n/a
Mol. Mass.:n/a
Description:n/a
Components:This complex has 0 components.
Component 1
Name:Neuronal acetylcholine receptor subunit alpha-4
Synonyms:ACHA4_RAT Cholinergic, Nicotinic Alpha4Beta2 Chrna4 Neuronal acetylcholine receptor (alpha4beta2 nAChR) Neuronal acetylcholine receptor subunit alpha 4 beta 2 | Neuronal acetylcholine receptor subunit alpha-4
Type:Enzyme
Mol. Mass.:70196.44
Organism:Rattus norvegicus (Rat)
Description:P09483
Residue:630
Component 2
Name:Neuronal acetylcholine receptor subunit beta-2
Synonyms:ACHB2_RAT Chrnb2 Neuronal acetylcholine receptor non-alpha-1 chain
Type:Enzyme
Mol. Mass.:56910.32
Organism:Rattus norvegicus (Rat)
Description:P12390
Residue:500
BDBM50106345
NameBDBM50106345
Synonyms:4-(4-Methyl-piperazin-1-yl)-phenylamine cid_737253
TypeSmall organic molecule
Emp. Form.C11H17N3
Mol. Mass.191.2728
SMILESCN1CCN(CC1)c1ccc(N)cc1