Reaction Details
TargetMuscarinic acetylcholine receptor M3
LigandBDBM50473795
Substrate/Competitorn/a
Meas. Tech.ChEMBL_138832 (CHEMBL752414)
Ki 398±n/a nM
Citation Böhme, TMAugelli-Szafran, CEHallak, HPugsley, TSerpa, KSchwarz, RD Synthesis and pharmacology of benzoxazines as highly selective antagonists at M(4) muscarinic receptors. J Med Chem45:3094-102 (2002) 
 
Muscarinic acetylcholine receptor M3
Name:Muscarinic acetylcholine receptor M3
Type:Enzyme
Mol. Mass.:66151.03
Organism:Homo sapiens (Human)
Description:P20309
Residue:590
BDBM50473795
NameBDBM50473795
Synonyms:CHEMBL105945
TypeSmall organic molecule
Emp. Form.C23H24N2O4
Mol. Mass.392.4477
SMILESCOC(=O)c1c(C)n(C)c2ccc3OC4N(CCc5cc(OC)ccc45)Cc3c12