Reaction Details
TargetMuscarinic acetylcholine receptor M3
LigandBDBM50473806
Substrate/Competitorn/a
Meas. Tech.ChEMBL_138832 (CHEMBL752414)
Ki 71±n/a nM
Citation Böhme, TMAugelli-Szafran, CEHallak, HPugsley, TSerpa, KSchwarz, RD Synthesis and pharmacology of benzoxazines as highly selective antagonists at M(4) muscarinic receptors. J Med Chem45:3094-102 (2002) 
 
Muscarinic acetylcholine receptor M3
Name:Muscarinic acetylcholine receptor M3
Type:Enzyme
Mol. Mass.:66151.03
Organism:Homo sapiens (Human)
Description:P20309
Residue:590
BDBM50473806
NameBDBM50473806
Synonyms:CHEMBL320465
TypeSmall organic molecule
Emp. Form.C25H28N2O4
Mol. Mass.420.5008
SMILESCCCc1[nH]c2ccc3OC4N(CCc5cc(OC)ccc45)Cc3c2c1C(=O)OCC