Reaction Details
TargetMuscarinic acetylcholine receptor M4
LigandBDBM50473805
Substrate/Competitorn/a
Meas. Tech.ChEMBL_139243 (CHEMBL746610)
Ki 15±n/a nM
Citation Böhme, TMAugelli-Szafran, CEHallak, HPugsley, TSerpa, KSchwarz, RD Synthesis and pharmacology of benzoxazines as highly selective antagonists at M(4) muscarinic receptors. J Med Chem45:3094-102 (2002) 
 
Muscarinic acetylcholine receptor M4
Name:Muscarinic acetylcholine receptor M4
Type:Enzyme Catalytic Domain
Mol. Mass.:53079.31
Organism:Homo sapiens (Human)
Description:Cholinergic, muscarinic M4 CHRM4 HUMAN M3::P08173
Residue:479
BDBM50473805
NameBDBM50473805
Synonyms:CHEMBL107444
TypeSmall organic molecule
Emp. Form.C24H26N2O4
Mol. Mass.406.4742
SMILESCCOC(=O)c1c(C)n(C)c2ccc3OC4N(CCc5cc(OC)ccc45)Cc3c12