Reaction Details
TargetMuscarinic acetylcholine receptor M4
LigandBDBM50473795
Substrate/Competitorn/a
Meas. Tech.ChEMBL_139243 (CHEMBL746610)
Ki 191±n/a nM
Citation Böhme, TMAugelli-Szafran, CEHallak, HPugsley, TSerpa, KSchwarz, RD Synthesis and pharmacology of benzoxazines as highly selective antagonists at M(4) muscarinic receptors. J Med Chem45:3094-102 (2002) 
 
Muscarinic acetylcholine receptor M4
Name:Muscarinic acetylcholine receptor M4
Type:Enzyme Catalytic Domain
Mol. Mass.:53079.31
Organism:Homo sapiens (Human)
Description:Cholinergic, muscarinic M4 CHRM4 HUMAN M3::P08173
Residue:479
BDBM50473795
NameBDBM50473795
Synonyms:CHEMBL105945
TypeSmall organic molecule
Emp. Form.C23H24N2O4
Mol. Mass.392.4477
SMILESCOC(=O)c1c(C)n(C)c2ccc3OC4N(CCc5cc(OC)ccc45)Cc3c12