Reaction Details
TargetMuscarinic acetylcholine receptor M1
LigandBDBM50473816
Substrate/Competitorn/a
Meas. Tech.ChEMBL_138544 (CHEMBL746412)
Ki 363±n/a nM
Citation Böhme, TMAugelli-Szafran, CEHallak, HPugsley, TSerpa, KSchwarz, RD Synthesis and pharmacology of benzoxazines as highly selective antagonists at M(4) muscarinic receptors. J Med Chem45:3094-102 (2002) 
 
Muscarinic acetylcholine receptor M1
Name:Muscarinic acetylcholine receptor M1
Type:Protein
Mol. Mass.:51442.54
Organism:Homo sapiens (Human)
Description:P11229
Residue:460
BDBM50473816
NameBDBM50473816
Synonyms:CHEMBL106219
TypeSmall organic molecule
Emp. Form.C31H32N2O4
Mol. Mass.496.5968
SMILESCCOC(=O)c1c(CC)n(Cc2ccccc2)c2ccc3OC4N(CCc5cc(OC)ccc45)Cc3c12