Reaction Details
TargetMuscarinic acetylcholine receptor M4
LigandBDBM50473799
Substrate/Competitorn/a
Meas. Tech.ChEMBL_139243 (CHEMBL746610)
Ki 72±n/a nM
Citation Böhme, TMAugelli-Szafran, CEHallak, HPugsley, TSerpa, KSchwarz, RD Synthesis and pharmacology of benzoxazines as highly selective antagonists at M(4) muscarinic receptors. J Med Chem45:3094-102 (2002) 
 
Muscarinic acetylcholine receptor M4
Name:Muscarinic acetylcholine receptor M4
Type:Enzyme Catalytic Domain
Mol. Mass.:53079.31
Organism:Homo sapiens (Human)
Description:Cholinergic, muscarinic M4 CHRM4 HUMAN M3::P08173
Residue:479
BDBM50473799
NameBDBM50473799
Synonyms:CHEMBL104332
TypeSmall organic molecule
Emp. Form.C32H32N2O5
Mol. Mass.524.6069
SMILESCOc1ccc(Cn2c(C)c(C(=O)OCC=C)c3c4CN5CCc6cc(OC)ccc6C5Oc4ccc23)cc1