Reaction Details
TargetMuscarinic acetylcholine receptor M4
LigandBDBM50473808
Substrate/Competitorn/a
Meas. Tech.ChEMBL_139243 (CHEMBL746610)
Ki 3.0±n/a nM
Citation Böhme, TMAugelli-Szafran, CEHallak, HPugsley, TSerpa, KSchwarz, RD Synthesis and pharmacology of benzoxazines as highly selective antagonists at M(4) muscarinic receptors. J Med Chem45:3094-102 (2002) 
 
Muscarinic acetylcholine receptor M4
Name:Muscarinic acetylcholine receptor M4
Type:Enzyme Catalytic Domain
Mol. Mass.:53079.31
Organism:Homo sapiens (Human)
Description:Cholinergic, muscarinic M4 CHRM4 HUMAN M3::P08173
Residue:479
BDBM50473808
NameBDBM50473808
Synonyms:CHEMBL318995
TypeSmall organic molecule
Emp. Form.C26H30N2O3S
Mol. Mass.450.593
SMILESCCCCc1[nH]c2ccc3OC4N(CCc5cc(SC)ccc45)Cc3c2c1C(=O)OCC