Reaction Details
TargetTubulin beta chain
LigandBDBM50012278
Substrate/Competitorn/a
Meas. Tech.ChEMBL_156792 (CHEMBL756956)
IC50 130±n/a nM
Citation Prinz, HIshii, YHirano, TStoiber, TCamacho Gomez, JASchmidt, PDüssmann, HBurger, AMPrehn, JHGünther, EGUnger, EUmezawa, K Novel benzylidene-9(10H)-anthracenones as highly active antimicrotubule agents. Synthesis, antiproliferative activity, and inhibition of tubulin polymerization. J Med Chem46:3382-94 (2003) 
 
Tubulin beta chain
Name:Tubulin beta chain
Type:PROTEIN
Mol. Mass.:49840.26
Organism:Sus scrofa
Description:ChEMBL_105107
Residue:445
BDBM50012278
NameBDBM50012278
Synonyms:(2ALPHA,2''BETA,3BETA,4ALPHA,5BETA)-VINCALEUKOBLASTINE VINBLASTINE cid_5388983
TypeSmall organic molecule
Emp. Form.C46H58N4O9
Mol. Mass.810.9741
SMILESCC[C@]1(O)C[C@@H]2CN(C1)CCc1c([nH]c3ccccc13)[C@@](C2)(C(=O)OC)c1cc2c(cc1OC)N(C)[C@@H]1[C@]22CCN3CC=C[C@](CC)([C@@H]23)[C@@H](OC(C)=O)[C@]1(O)C(=O)OC