Reaction Details
TargetMelanin-concentrating hormone receptor 1
LigandBDBM50475903
Substrate/Competitorn/a
Meas. Tech.ChEMBL_402584 (CHEMBL906920)
Ki 20±n/a nM
Citation Witty, DRBateson, JHHervieu, GJJeffrey, PJohnson, CNMuir, AIO'Hanlon, PJStemp, GStevens, AJThewlis, KMWilson, SWinborn, KY SAR of biphenyl carboxamide ligands of the human melanin-concentrating hormone receptor 1 (MCH R1): discovery of antagonist SB-568849. Bioorg Med Chem Lett16:4865-71 (2006) 
 
Melanin-concentrating hormone receptor 1
Name:Melanin-concentrating hormone receptor 1
Type:G Protein-Coupled Receptor (GPCR)
Mol. Mass.:45976.27
Organism:Homo sapiens (Human)
Description:Membranes from CHO-K1 cells stably expressing human MCH1R were used in assays.
Residue:422
BDBM50475903
NameBDBM50475903
Synonyms:CHEMBL212890
TypeSmall organic molecule
Emp. Form.C27H32N2O3
Mol. Mass.432.5546
SMILESCCN(CC)CCOc1ccc(cc1OC)N(C)C(=O)c1ccc(cc1)-c1ccccc1