Reaction Details
TargetMelanin-concentrating hormone receptor 1
LigandBDBM50211167
Substrate/Competitorn/a
Meas. Tech.ChEMBL_402584 (CHEMBL906920)
Ki 32±n/a nM
Citation Witty, DRBateson, JHHervieu, GJJeffrey, PJohnson, CNMuir, AIO'Hanlon, PJStemp, GStevens, AJThewlis, KMWilson, SWinborn, KY SAR of biphenyl carboxamide ligands of the human melanin-concentrating hormone receptor 1 (MCH R1): discovery of antagonist SB-568849. Bioorg Med Chem Lett16:4865-71 (2006) 
 
Melanin-concentrating hormone receptor 1
Name:Melanin-concentrating hormone receptor 1
Type:G Protein-Coupled Receptor (GPCR)
Mol. Mass.:45976.27
Organism:Homo sapiens (Human)
Description:Membranes from CHO-K1 cells stably expressing human MCH1R were used in assays.
Residue:422
BDBM50211167
NameBDBM50211167
Synonyms:CHEMBL213255 | biphenyl-4-carboxylic acid [3-methoxy-4-(2-pyrrolidin-1-yl-ethoxy)-phenyl]-amide
TypeSmall organic molecule
Emp. Form.C26H28N2O3
Mol. Mass.416.5121
SMILESCOc1cc(NC(=O)c2ccc(cc2)-c2ccccc2)ccc1OCCN1CCCC1