Reaction Details
TargetMelanin-concentrating hormone receptor 1
LigandBDBM50475909
Substrate/Competitorn/a
Meas. Tech.ChEMBL_402584 (CHEMBL906920)
Ki 100±n/a nM
Citation Witty, DRBateson, JHHervieu, GJJeffrey, PJohnson, CNMuir, AIO'Hanlon, PJStemp, GStevens, AJThewlis, KMWilson, SWinborn, KY SAR of biphenyl carboxamide ligands of the human melanin-concentrating hormone receptor 1 (MCH R1): discovery of antagonist SB-568849. Bioorg Med Chem Lett16:4865-71 (2006) 
 
Melanin-concentrating hormone receptor 1
Name:Melanin-concentrating hormone receptor 1
Type:G Protein-Coupled Receptor (GPCR)
Mol. Mass.:45976.27
Organism:Homo sapiens (Human)
Description:Membranes from CHO-K1 cells stably expressing human MCH1R were used in assays.
Residue:422
BDBM50475909
NameBDBM50475909
Synonyms:CHEMBL213198
TypeSmall organic molecule
Emp. Form.C29H42N2O3
Mol. Mass.466.6554
SMILESCOc1cc(ccc1OCCN(C(C)C)C(C)C)N(C)C(=O)c1ccc(cc1)C1CCCCC1