Reaction Details
Target5-hydroxytryptamine receptor 2C
LigandBDBM50475895
Substrate/Competitorn/a
Meas. Tech.ChEMBL_402581 (CHEMBL906917)
Ki 158±n/a nM
Citation Witty, DRBateson, JHHervieu, GJJeffrey, PJohnson, CNMuir, AIO'Hanlon, PJStemp, GStevens, AJThewlis, KMWilson, SWinborn, KY SAR of biphenyl carboxamide ligands of the human melanin-concentrating hormone receptor 1 (MCH R1): discovery of antagonist SB-568849. Bioorg Med Chem Lett16:4865-71 (2006) 
 
5-hydroxytryptamine receptor 2C
Name:5-hydroxytryptamine receptor 2C
Type:G Protein-Coupled Receptor (GPCR)
Mol. Mass.:51836.79
Organism:Homo sapiens (Human)
Description:P28335
Residue:458
BDBM50475895
NameBDBM50475895
Synonyms:CHEMBL385254
TypeSmall organic molecule
Emp. Form.C28H34N2O3
Mol. Mass.446.5812
SMILESCOc1cc(NC(=O)c2ccc(cc2)-c2ccccc2)ccc1OCCN(C(C)C)C(C)C