Reaction Details
TargetMelanin-concentrating hormone receptor 1
LigandBDBM50475918
Substrate/Competitorn/a
Meas. Tech.ChEMBL_402584 (CHEMBL906920)
Ki 25±n/a nM
Citation Witty, DRBateson, JHHervieu, GJJeffrey, PJohnson, CNMuir, AIO'Hanlon, PJStemp, GStevens, AJThewlis, KMWilson, SWinborn, KY SAR of biphenyl carboxamide ligands of the human melanin-concentrating hormone receptor 1 (MCH R1): discovery of antagonist SB-568849. Bioorg Med Chem Lett16:4865-71 (2006) 
 
Melanin-concentrating hormone receptor 1
Name:Melanin-concentrating hormone receptor 1
Type:G Protein-Coupled Receptor (GPCR)
Mol. Mass.:45976.27
Organism:Homo sapiens (Human)
Description:Membranes from CHO-K1 cells stably expressing human MCH1R were used in assays.
Residue:422
BDBM50475918
NameBDBM50475918
Synonyms:CHEMBL212032
TypeSmall organic molecule
Emp. Form.C28H40N2O3
Mol. Mass.452.6288
SMILESCOc1cc(NC(=O)c2ccc(cc2)C2CCCCC2)ccc1OCCN(C(C)C)C(C)C