Reaction Details
TargetAlpha-1D adrenergic receptor
LigandBDBM50476083
Substrate/Competitorn/a
Meas. Tech.ChEMBL_425084 (CHEMBL913649)
Ki 0.165959±n/a nM
Citation Romeo, GMateria, LMarucci, GModica, MPittalą, VSalerno, LSiracusa, MABuccioni, MAngeli, PMinneman, KP New pyrimido[5,4-b]indoles and [1]benzothieno[3,2-d]pyrimidines: high affinity ligands for the alpha(1)-adrenoceptor subtypes. Bioorg Med Chem Lett16:6200-3 (2006) 
 
Alpha-1D adrenergic receptor
Name:Alpha-1D adrenergic receptor
Type:Enzyme Catalytic Domain
Mol. Mass.:60485.82
Organism:Homo sapiens (Human)
Description:adrenergic Alpha1D ADRA1D HUMAN::P25100
Residue:572
BDBM50476083
NameBDBM50476083
Synonyms:CHEMBL220515
TypeSmall organic molecule
Emp. Form.C24H26ClN5O2
Mol. Mass.451.949
SMILESCOc1ccc(Cl)cc1N1CCN(CCn2c(C)nc3c4ccccc4[nH]c3c2=O)CC1