Reaction Details
TargetDihydrofolate reductase
LigandBDBM50027974
Substrate/Competitorn/a
Meas. Tech.ChEMBL_54924 (CHEMBL666410)
Ki 5.3±n/a nM
Citation Birdsall, BFeeney, JPascual, CRoberts, GCKompis, IThen, RLMüller, KKroehn, A A 1H NMR study of the interactions and conformations of rationally designed brodimoprim analogues in complexes with Lactobacillus casei dihydrofolate reductase. J Med Chem27:1672-6 (1985) Dihydrofolate reductase
Name:Dihydrofolate reductase
Type:PROTEIN
Mol. Mass.:18437.08
Organism:Lactobacillus casei
Description:ChEMBL_1357878
Residue:163
BDBM50027974
NameBDBM50027974
Synonyms:3-{3-[2-Bromo-5-(2,4-diamino-pyrimidin-5-ylmethyl)-3-methoxy-phenoxy]-propylamino}-propionic acid | CHEMBL46980
TypeSmall organic molecule
Emp. Form.C18H24BrN5O4
Mol. Mass.454.318
SMILESCOc1cc(Cc2cnc(N)nc2N)cc(OCCCNCCC(O)=O)c1Br