Reaction Details
TargetDihydrofolate reductase
LigandBDBM50027972
Substrate/Competitorn/a
Meas. Tech.ChEBML_54924
Ki 0.600000±n/a nM
Citation Birdsall, BFeeney, JPascual, CRoberts, GCKompis, IThen, RLMüller, KKroehn, A A 1H NMR study of the interactions and conformations of rationally designed brodimoprim analogues in complexes with Lactobacillus casei dihydrofolate reductase. J Med Chem27:1672-6 (1985) Dihydrofolate reductase
Name:Dihydrofolate reductase
Type:PROTEIN
Mol. Mass.:18437.08
Organism:Lactobacillus casei
Description:ChEMBL_1357878
Residue:163
BDBM50027972
NameBDBM50027972
Synonyms:7-[2-Bromo-5-(2,4-diamino-pyrimidin-5-ylmethyl)-3-methoxy-phenoxy]-heptanoic acid | CHEMBL31713
TypeSmall organic molecule
Emp. Form.C19H25BrN4O4
Mol. Mass.453.33
SMILESCOc1cc(Cc2cnc(N)nc2N)cc(OCCCCCCC(O)=O)c1Br