Reaction Details
TargetDihydrofolate reductase
LigandBDBM50225252
Substrate/Competitorn/a
Meas. Tech.ChEMBL_54923 (CHEMBL666409)
Ki<0.010000±n/a nM
Citation Birdsall, BFeeney, JPascual, CRoberts, GCKompis, IThen, RLMüller, KKroehn, A A 1H NMR study of the interactions and conformations of rationally designed brodimoprim analogues in complexes with Lactobacillus casei dihydrofolate reductase. J Med Chem27:1672-6 (1985) Dihydrofolate reductase
Name:Dihydrofolate reductase
Type:PROTEIN
Mol. Mass.:18437.08
Organism:Lactobacillus casei
Description:ChEMBL_1357878
Residue:163
BDBM50225252
NameBDBM50225252
Synonyms:CHEMBL296525
TypeSmall organic molecule
Emp. Form.C20H25BrN4O6
Mol. Mass.497.34
SMILESCOc1cc(Cc2cnc(N)nc2N)cc(OCCCC(CCC(O)=O)C(O)=O)c1Br