Reaction Details
Target5-hydroxytryptamine receptor 1A/1B/1D/1F/2A/2B/2C/3A/3B/4/5A/5B/6/7
LigandBDBM50028124
Substrate/Competitorn/a
Meas. Tech.ChEMBL_3517 (CHEMBL619187)
IC50 630±n/a nM
Citation Glennon, RAJacyno, JMYoung, RMcKenney, JDNelson, D Synthesis and evaluation of a novel series of N,N-dimethylisotryptamines. J Med Chem27:41-5 (1984) 5-hydroxytryptamine receptor 1A/1B/1D/1F/2A/2B/2C/3A/3B/4/5A/5B/6/7
Name:5-hydroxytryptamine receptor 1A/1B/1D/1F/2A/2B/2C/3A/3B/4/5A/5B/6/7
Synonyms:Serotonin (5-HT) receptor
Type:n/a
Mol. Mass.:n/a
Description:ASSAY_ID of ChEMBL is 3517
Components:This complex has 14 components.
Component 1
Name:5-hydroxytryptamine receptor 3B
Type:PROTEIN
Mol. Mass.:50328.78
Organism:Rattus norvegicus
Description:EBI_11885
Residue:437
Component 2
Name:5-hydroxytryptamine receptor 7
Synonyms:5-HT-7 5-HT7 5-HT7S 5-hydroxytryptamine receptor 7 5HT7R_RAT GPRFO Serotonin (5-HT) receptor | Serotonin Receptor 7
Type:G Protein-Coupled Receptor (GPCR)
Mol. Mass.:49852.62
Organism:Rattus norvegicus (rat)
Description:Rat cloned 5-HT7R.
Residue:448
Component 3
Name:5-hydroxytryptamine receptor 1F
Synonyms:5-HT-1F 5-hydroxytryptamine receptor 1F 5ht1f Serotonin 1 (5-HT1) receptor Serotonin receptor 1F
Type:Enzyme Catalytic Domain
Mol. Mass.:41896.93
Organism:RAT
Description:5-HT1F HTR1F RAT::P30940
Residue:366
Component 4
Name:5-hydroxytryptamine receptor 4
Synonyms:5-HT-4 5-HT4L 5-hydroxytryptamine receptor 4 Htr4 Serotonin 4 (5-HT4) receptor
Type:Enzyme Catalytic Domain
Mol. Mass.:46117.31
Organism:RAT
Description:5-HT4 HTR4 RAT::Q62758
Residue:406
Component 5
Name:5-hydroxytryptamine receptor 2B
Synonyms:5-HT2B 5HT2B_RAT Serotonin 2b (5-HT2b) receptor Srl
Type:Enzyme Catalytic Domain
Mol. Mass.:53668.47
Organism:RAT
Description:5-HT2B HTR2B RAT::P30994
Residue:479
Component 6
Name:5-hydroxytryptamine receptor 1A
Synonyms:5-HT-1A 5-HT1A 5-hydroxytryptamine receptor 1A (5HT1A) 5ht1a Htr1a Serotonin 1a (5-HT1a) receptor/Adrenergic receptor alpha-1 | Serotonin receptor 1A
Type:G Protein-Coupled Receptor (GPCR)
Mol. Mass.:46445.29
Organism:Rattus norvegicus (rat)
Description:Binding assays were performed using rat hippocampal membranes.
Residue:422
Component 7
Name:5-hydroxytryptamine receptor 2A
Synonyms:5-HT-2A 5-HT2A 5-hydroxytryptamine receptor 2A (5HT2A) Htr2 Serotonin Receptor 2A
Type:G Protein-Coupled Receptor (GPCR)
Mol. Mass.:52852.05
Organism:Rattus norvegicus (rat)
Description:Rat cortex membranes 5-HT2A receptors.
Residue:471
Component 8
Name:5-hydroxytryptamine receptor 5B
Synonyms:5-HT5B 5HT5B_RAT Htr5b Serotonin 5b (5-HT5b) receptor
Type:Enzyme Catalytic Domain
Mol. Mass.:41141.95
Organism:RAT
Description:5-HT5B 0 RAT::P35365
Residue:370
Component 9
Name:5-hydroxytryptamine receptor 1D
Synonyms:5-HT-1D 5-hydroxytryptamine receptor 1D Htr1d Serotonin 1B/1D receptor | Serotonin receptor 1D
Type:Enzyme Catalytic Domain
Mol. Mass.:41551.75
Organism:RAT
Description:5-HT1D HTR1D RAT::P28565
Residue:374
Component 10
Name:5-hydroxytryptamine receptor 2C
Synonyms:5-HT2C 5-hydroxytryptamine receptor 2C (5HT2c) 5ht1c Htr2c Serotonin receptor 2a and 2c (5HT2A and 5HT2C)
Type:Enzyme
Mol. Mass.:51935.10
Organism:Rattus norvegicus (Rat)
Description:P08909
Residue:460
Component 11
Name:5-hydroxytryptamine receptor 5A
Synonyms:5-HT-5A 5-hydroxytryptamine receptor 5A 5ht5a REC17 Serotonin receptor 5A
Type:Enzyme Catalytic Domain
Mol. Mass.:40684.21
Organism:RAT
Description:5-HT5a HTR5A RAT::P35364
Residue:357
Component 12
Name:5-hydroxytryptamine receptor 6
Synonyms:5-HT-6 5-hydroxytryptamine receptor 6 Htr6 Serotonin (5-HT) receptor Serotonin receptor 6
Type:Enzyme Catalytic Domain
Mol. Mass.:46945.51
Organism:RAT
Description:5-HT6 HTR6 RAT::P31388
Residue:436
Component 13
Name:5-hydroxytryptamine receptor 3A
Synonyms:5-HT3 5HT3A_RAT Htr3 Serotonin (5-HT) receptor | Zacopride site-R
Type:Enzyme Catalytic Domain
Mol. Mass.:55428.70
Organism:RAT
Description:5-HT3 HTR3A RAT::P35563
Residue:483
Component 14
Name:5-hydroxytryptamine receptor 1B
Synonyms:5-HT-1B 5-hydroxytryptamine receptor 1B (5HT1B) 5ht1b Serotonin 1 (5-HT1) receptor Serotonin receptor 1B
Type:Protein
Mol. Mass.:43173.33
Organism:Rattus norvegicus (Rat)
Description:P28564
Residue:386
BDBM50028124
NameBDBM50028124
Synonyms:2-(6-Methoxy-1H-indol-3-yl)-ethylamine 6-MeOT | CHEMBL337825
TypeSmall organic molecule
Emp. Form.C11H14N2O
Mol. Mass.190.2417
SMILESCOc1ccc2c(CCN)c[nH]c2c1