Reaction Details
TargetProtease
LigandBDBM8125
Substrate/Competitorn/a
Meas. Tech.ChEMBL_476088 (CHEMBL926963)
Ki 0.016±n/a nM
Citation Koh, YMatsumi, SDas, DAmano, MDavis, DALi, JLeschenko, SBaldridge, AShioda, TYarchoan, RGhosh, AKMitsuya, H Potent inhibition of HIV-1 replication by novel non-peptidyl small molecule inhibitors of protease dimerization. J Biol Chem282:28709-20 (2007) 
 
Protease
Name:Protease
Synonyms:n/a
Type:Enzyme
Mol. Mass.:10904.79
Organism:Human immunodeficiency virus 1 (HIV-1)
Description:Q9YQ12
Residue:99
BDBM8125
NameBDBM8125
TypeSmall organic molecule
Emp. Form.C27H37N3O7S
Mol. Mass.547.664
SMILES[H][C@@]1(CO[C@@]2([H])OCC[C@@]12[H])OC(=O)N[C@@H](Cc1ccccc1)[C@H](O)CN(CC(C)C)S(=O)(=O)c1ccc(N)cc1