Reaction Details
TargetAldo-keto reductase family 1 member B1
LigandBDBM16452
Substrate/Competitorn/a
Meas. Tech.ChEMBL_530350 (CHEMBL968446)
IC50 5.0±n/a nM
Citation Stefek, MSnirc, VDjoubissie, POMajekova, MDemopoulos, VRackova, LBezakova, ZKarasu, CCarbone, VEl-Kabbani, O Carboxymethylated pyridoindole antioxidants as aldose reductase inhibitors: Synthesis, activity, partitioning, and molecular modeling. Bioorg Med Chem16:4908-20 (2008) 
 
Aldo-keto reductase family 1 member B1
Name:Aldo-keto reductase family 1 member B1
Type:PROTEIN
Mol. Mass.:35797.87
Organism:Rattus norvegicus
Description:ChEMBL_1512484
Residue:316
BDBM16452
NameBDBM16452
Synonyms:(4-oxo-3-{[5-(trifluoromethyl)-1,3-benzothiazol-2-yl]methyl}-3,4-dihydrophthalazin-1-yl)acetic acid Alond Xedia | Zopolrestat
TypeSmall organic molecule
Emp. Form.C19H12F3N3O3S
Mol. Mass.419.377
SMILESOC(=O)Cc1nn(Cc2nc3cc(ccc3s2)C(F)(F)F)c(=O)c2ccccc12