Reaction Details
TargetFatty acid synthase
LigandBDBM50009248
Substrate/Competitorn/a
Meas. Tech.ChEMBL_504193 (CHEMBL985841)
IC50 2230±n/a nM
Citation Laakso, JARaulli, RMcElhaney-Feser, GEActor, PUnderiner, TLHotovec, BJMocek, UCihlar, RLBroedel, SE CT2108A and B: New fatty acid synthase inhibitors as antifungal agents. J Nat Prod66:1041-6 (2003) 
 
Fatty acid synthase
Name:Fatty acid synthase
Type:Enzyme
Mol. Mass.:273419.37
Organism:Homo sapiens (Human)
Description:P49327
Residue:2511
BDBM50009248
NameBDBM50009248
Synonyms:(2R,3S)-3-((4E,7E)-Nona-4,7-dienoyl)-oxirane-2-carboxylic acid amide 3-Nona-4,7-dienoyl-oxirane-2-carboxylic acid amide CERULENIN | CHEMBL45627
TypeSmall organic molecule
Emp. Form.C12H17NO3
Mol. Mass.223.2683
SMILESC\C=C\C\C=C\CCC(=O)[C@H]1O[C@H]1C(N)=O