Reaction Details
TargetThymidylate synthase
LigandBDBM50028372
Substrate/Competitorn/a
Meas. Tech.ChEBML_217700
Ki 2000±n/a nM
Citation Barr, PJNolan, PASanti, DVRobins, MJ Inhibition of thymidylate synthetase by 5-alkynyl-2'-deoxyuridylates. J Med Chem24:1385-8 (1982) Thymidylate synthase
Name:Thymidylate synthase
Type:Enzyme
Mol. Mass.:36576.54
Organism:Lactobacillus casei
Description:n/a
Residue:316
BDBM50028372
NameBDBM50028372
Synonyms:CHEMBL3143873 | Phosphoric acid mono-[5-(2,4-dioxo-5-phenylethynyl-3,4-dihydro-2H-pyrimidin-1-yl)-3-hydroxy-tetrahydro-furan-2-ylmethyl] ester
TypeSmall organic molecule
Emp. Form.C17H17N2O8P
Mol. Mass.408.2992
SMILESO[C@H]1C[C@@H](O[C@@H]1COP(O)(O)=O)n1cc(C#Cc2ccccc2)c(=O)[nH]c1=O