Reaction Details
TargetReceptor-type tyrosine-protein kinase FLT3
LigandBDBM50479264
Substrate/Competitorn/a
Meas. Tech.ChEMBL_553941 (CHEMBL962874)
IC50 975±n/a nM
Citation Aly, AHEdrada-Ebel, RIndriani, IDWray, VMüller, WETotzke, FZirrgiebel, USchächtele, CKubbutat, MHLin, WHProksch, PEbel, R Cytotoxic metabolites from the fungal endophyte Alternaria sp. and their subsequent detection in its host plant Polygonum senegalense. J Nat Prod71:972-80 (2008) 
 
Receptor-type tyrosine-protein kinase FLT3
Name:Receptor-type tyrosine-protein kinase FLT3
Type:Enzyme
Mol. Mass.:112888.62
Organism:Homo sapiens (Human)
Description:P36888
Residue:993
BDBM50479264
NameBDBM50479264
Synonyms:Alternariol 5-O-Sulfate | CHEMBL483525
TypeSmall organic molecule
Emp. Form.C14H10O8S
Mol. Mass.338.289
SMILESCc1cc(O)cc2oc(=O)c3c(O)cc(OS(O)(=O)=O)cc3c12