Reaction Details
TargetAurora kinase B
LigandBDBM50479264
Substrate/Competitorn/a
Meas. Tech.ChEMBL_553814 (CHEMBL966177)
IC50 650±n/a nM
Citation Aly, AHEdrada-Ebel, RIndriani, IDWray, VMüller, WETotzke, FZirrgiebel, USchächtele, CKubbutat, MHLin, WHProksch, PEbel, R Cytotoxic metabolites from the fungal endophyte Alternaria sp. and their subsequent detection in its host plant Polygonum senegalense. J Nat Prod71:972-80 (2008) 
 
Aurora kinase B
Name:Aurora kinase B
Type:Protein
Mol. Mass.:39327.72
Organism:Homo sapiens (Human)
Description:Q96GD4
Residue:344
BDBM50479264
NameBDBM50479264
Synonyms:Alternariol 5-O-Sulfate | CHEMBL483525
TypeSmall organic molecule
Emp. Form.C14H10O8S
Mol. Mass.338.289
SMILESCc1cc(O)cc2oc(=O)c3c(O)cc(OS(O)(=O)=O)cc3c12