Reaction Details
TargetVoltage-dependent L-type calcium channel subunit alpha-1S
LigandBDBM50479920
Substrate/Competitorn/a
Meas. Tech.ChEMBL_563140 (CHEMBL1009068)
Ki 23680±n/a nM
Citation Budriesi, RCosimelli, BIoan, PUgenti, MPCarosati, EFrosini, MFusi, FSpisani, RSaponara, SCruciani, GNovellino, ESpinelli, DChiarini, A L-Type calcium channel blockers: from diltiazem to 1,2,4-oxadiazol-5-ones via thiazinooxadiazol-3-one derivatives. J Med Chem52:2352-62 (2009) 
 
Voltage-dependent L-type calcium channel subunit alpha-1S
Name:Voltage-dependent L-type calcium channel subunit alpha-1S
Type:PROTEIN
Mol. Mass.:210392.58
Organism:Rattus norvegicus
Description:ChEMBL_92777
Residue:1850
BDBM50479920
NameBDBM50479920
Synonyms:CHEMBL523271
TypeSmall organic molecule
Emp. Form.C13H11BrN2O4S
Mol. Mass.371.206
SMILESC[S+]([O-])\C=C(\C)n1c(noc1=O)C(=O)c1ccc(Br)cc1