Reaction Details
TargetVoltage-dependent L-type calcium channel subunit alpha-1S
LigandBDBM50479921
Substrate/Competitorn/a
Meas. Tech.ChEMBL_563140 (CHEMBL1009068)
Ki 490±n/a nM
Citation Budriesi, RCosimelli, BIoan, PUgenti, MPCarosati, EFrosini, MFusi, FSpisani, RSaponara, SCruciani, GNovellino, ESpinelli, DChiarini, A L-Type calcium channel blockers: from diltiazem to 1,2,4-oxadiazol-5-ones via thiazinooxadiazol-3-one derivatives. J Med Chem52:2352-62 (2009) 
 
Voltage-dependent L-type calcium channel subunit alpha-1S
Name:Voltage-dependent L-type calcium channel subunit alpha-1S
Type:PROTEIN
Mol. Mass.:210392.58
Organism:Rattus norvegicus
Description:ChEMBL_92777
Residue:1850
BDBM50479921
NameBDBM50479921
Synonyms:CHEMBL508166
TypeSmall organic molecule
Emp. Form.C13H11BrN2O3S
Mol. Mass.355.207
SMILESCS\C=C(\C)n1c(noc1=O)C(=O)c1ccc(Br)cc1