Reaction Details
TargetVoltage-dependent L-type calcium channel subunit alpha-1S
LigandBDBM50479922
Substrate/Competitorn/a
Meas. Tech.ChEMBL_563140 (CHEMBL1009068)
Ki 290±n/a nM
Citation Budriesi, RCosimelli, BIoan, PUgenti, MPCarosati, EFrosini, MFusi, FSpisani, RSaponara, SCruciani, GNovellino, ESpinelli, DChiarini, A L-Type calcium channel blockers: from diltiazem to 1,2,4-oxadiazol-5-ones via thiazinooxadiazol-3-one derivatives. J Med Chem52:2352-62 (2009) 
 
Voltage-dependent L-type calcium channel subunit alpha-1S
Name:Voltage-dependent L-type calcium channel subunit alpha-1S
Type:PROTEIN
Mol. Mass.:210392.58
Organism:Rattus norvegicus
Description:ChEMBL_92777
Residue:1850
BDBM50479922
NameBDBM50479922
Synonyms:CHEMBL489002
TypeSmall organic molecule
Emp. Form.C12H9BrN2O3S
Mol. Mass.341.18
SMILESCC1=CSC(O)(c2noc(=O)n12)c1ccc(Br)cc1