Reaction Details
TargetReverse transcriptase
LigandBDBM50139772
Substrate/Competitorn/a
Meas. Tech.ChEMBL_545151 (CHEMBL1018093)
IC50>242000±n/a nM
Citation Tan, GTPezzuto, JMKinghorn, ADHughes, SH Evaluation of natural products as inhibitors of human immunodeficiency virus type 1 (HIV-1) reverse transcriptase. J Nat Prod54:143-54
 
Reverse transcriptase
Name:Reverse transcriptase
Synonyms:n/a
Type:Protein
Mol. Mass.:29598.37
Organism:Human immunodeficiency virus 1
Description:Q9WKE8
Residue:254
BDBM50139772
NameBDBM50139772
TypeSmall organic molecule
Emp. Form.C46H56N4O10
Mol. Mass.824.9576
SMILESCC[C@]1(O)C[C@H]2CN(C1)CCc1c([nH]c3ccccc13)[C@@](C2)(C(=O)OC)c1cc2c(cc1OC)N(C=O)[C@@H]1[C@]22CCN3CC=C[C@](CC)([C@@H]23)[C@@H](OC(C)=O)[C@]1(O)C(=O)OC