Reaction Details
TargetReverse transcriptase
LigandBDBM50187658
Substrate/Competitorn/a
Meas. Tech.ChEMBL_545151 (CHEMBL1018093)
IC50>703000±n/a nM
Citation Tan, GTPezzuto, JMKinghorn, ADHughes, SH Evaluation of natural products as inhibitors of human immunodeficiency virus type 1 (HIV-1) reverse transcriptase. J Nat Prod54:143-54
 
Reverse transcriptase
Name:Reverse transcriptase
Synonyms:n/a
Type:Protein
Mol. Mass.:29598.37
Organism:Human immunodeficiency virus 1
Description:Q9WKE8
Residue:254
BDBM50187658
NameBDBM50187658
TypeSmall organic molecule
Emp. Form.C16H12O5
Mol. Mass.284.2635
SMILESCOc1cc(O)c2c(c1)oc(cc2=O)-c1ccc(O)cc1