Reaction Details
TargetHeat shock protein HSP 90-alpha/90-beta
LigandBDBM50480393
Substrate/Competitorn/a
Meas. Tech.ChEMBL_572644 (CHEMBL1026068)
IC50 9000±n/a nM
Citation Huang, KHVeal, JMFadden, RPRice, JWEaves, JStrachan, JPBarabasz, AFFoley, BEBarta, TEMa, WSilinski, MAHu, MPartridge, JMScott, ADuBois, LGFreed, TSteed, PMOmmen, AJSmith, EDHughes, PFWoodward, ARHanson, GJMcCall, WSMarkworth, CJHinkley, LJenks, MGeng, LLewis, MOtto, JPronk, BVerleysen, KHall, SE Discovery of novel 2-aminobenzamide inhibitors of heat shock protein 90 as potent, selective and orally active antitumor agents. J Med Chem52:4288-305 (2009) 
 
Heat shock protein HSP 90-alpha/90-beta
Name:Heat shock protein HSP 90-alpha/90-beta
Type:n/a
Mol. Mass.:n/a
Description:ASSAY_ID of EBI is 29664
Components:This complex has 2 components.
Component 1
Name:Heat shock protein HSP 90-alpha
Synonyms:HS90A_HUMAN HSP86 HSP90AA1 HSPCA Heat shock 86 kDa Heat shock protein HSP 90-alpha (HSP90) LAP-2 Lipopolysaccharide-associated protein 2 heat shock protein 90kDa alpha (cytosolic), class A member 1 isoform 2
Type:Molecular Chaperone
Mol. Mass.:84623.45
Organism:Homo sapiens (Human)
Description:P07900
Residue:732
Component 2
Name:Heat shock protein HSP 90-beta
Synonyms:HS90B_HUMAN HSP 90 HSP90B HSPCB Heat shock protein HSP 90 (Hsp90)
Type:Molecular Chaperone
Mol. Mass.:83229.45
Organism:Homo sapiens (Human)
Description:P08238
Residue:724
BDBM50480393
NameBDBM50480393
Synonyms:CHEMBL563500
TypeSmall organic molecule
Emp. Form.C24H32N4O3
Mol. Mass.424.5359
SMILESCCc1nn(c2CC(C)(C)CC(=O)c12)-c1ccc(C(N)=O)c(N[C@H]2CC[C@H](O)CC2)c1