Reaction Details
TargetSmoothened homolog
LigandBDBM50480723
Substrate/Competitorn/a
Meas. Tech.ChEMBL_582068 (CHEMBL1060787)
IC50 5.0±n/a nM
Citation Dessole, GBranca, DFerrigno, FKinzel, OMuraglia, EPalumbi, MCRowley, MSerafini, SSteinkühler, CJones, P Discovery of N-[(1-aryl-1H-indazol-5-yl)methyl]amides derivatives as smoothened antagonists for inhibition of the hedgehog pathway. Bioorg Med Chem Lett19:4191-5 (2009) 
 
Smoothened homolog
Name:Smoothened homolog
Type:Protein
Mol. Mass.:86415.51
Organism:Homo sapiens (Human)
Description:Q99835
Residue:787
BDBM50480723
NameBDBM50480723
Synonyms:CHEMBL561533
TypeSmall organic molecule
Emp. Form.C23H29N3O2
Mol. Mass.379.4953
SMILESCCCC(CCC)C(=O)NCc1ccc2n(ncc2c1)-c1ccccc1OC