Reaction Details
TargetReverse transcriptase protein
LigandBDBM50138406
Substrate/Competitorn/a
Meas. Tech.ChEMBL_583931 (CHEMBL1061782)
Kd 430±n/a nM
Citation Zelina, SSheen, CWRadzio, JMellors, JWSluis-Cremer, N Mechanisms by which the G333D mutation in human immunodeficiency virus type 1 Reverse transcriptase facilitates dual resistance to zidovudine and lamivudine. Antimicrob Agents Chemother52:157-63 (2008) 
 
Reverse transcriptase protein
Name:Reverse transcriptase protein
Type:Protein
Mol. Mass.:30203.56
Organism:Human immunodeficiency virus 1
Description:Q9WJQ2
Residue:259
BDBM50138406
NameBDBM50138406
Synonyms:3TC Triphosphate LAMIVUDINE [(2R,5S)-5-(4-amino-2-oxopyrimidin-1(2H)-yl)-1,3-oxathiolan-2-yl]methyl tetrahydrogen triphosphate | [[[5-(4-amino-2-oxo-1H-pyrimidin-1-yl)-1,3-oxathiolan-2-yl]methoxy-hydroxy-phosphoryl]oxy-hydroxy-phosphoryl]oxyphosphonic acid
TypeSmall organic molecule
Emp. Form.C8H14N3O12P3S
Mol. Mass.469.196
SMILESNc1ccn([C@@H]2CS[C@H](COP(O)(=O)OP(O)(=O)OP(O)(O)=O)O2)c(=O)n1