Reaction Details
TargetProtease
LigandBDBM50067593
Substrate/Competitorn/a
Meas. Tech.ChEMBL_594343 (CHEMBL1048541)
Ki 0.300000±n/a nM
Citation Mahalingam, AKAxelsson, LEkegren, JKWannberg, JKihlström, JUnge, TWallberg, HSamuelsson, BLarhed, MHallberg, A HIV-1 protease inhibitors with a transition-state mimic comprising a tertiary alcohol: improved antiviral activity in cells. J Med Chem53:607-15 (2010) 
 
Protease
Name:Protease
Synonyms:n/a
Type:Enzyme
Mol. Mass.:10904.79
Organism:Human immunodeficiency virus 1 (HIV-1)
Description:Q9YQ12
Residue:99
BDBM50067593
NameBDBM50067593
TypeSmall organic molecule
Emp. Form.C36H47N5O4
Mol. Mass.613.7895
SMILESCC(C)(C)NC(=O)[C@@H]1CN(Cc2cccnc2)CCN1C[C@@H](O)C[C@@H](Cc1ccccc1)C(=O)N[C@@H]1[C@H](O)Cc2ccccc12