Reaction Details
TargetCatechol O-methyltransferase
LigandBDBM50028547
Substrate/Competitorn/a
Meas. Tech.ChEBML_47077
Ki 15200000±n/a nM
Citation Borchardt, RTBhatia, P Catechol O-methyltransferase. 12. Affinity labeling the active site with the oxidation products of 5,6-dihydroxyindole. J Med Chem25:263-71 (1982) Catechol O-methyltransferase
Name:Catechol O-methyltransferase
Type:Enzyme
Mol. Mass.:29594.09
Organism:Rattus norvegicus (Rat)
Description:n/a
Residue:264
BDBM50028547
NameBDBM50028547
Synonyms:4-Methyl-1H-indole-5,6-diol | CHEMBL90571
TypeSmall organic molecule
Emp. Form.C9H9NO2
Mol. Mass.163.1733
SMILESCc1c(O)c(O)cc2[nH]ccc12