Reaction Details
TargetEukaryotic initiation factor 4A-I
LigandBDBM50482551
Substrate/Competitorn/a
Meas. Tech.ChEMBL_653215 (CHEMBL1226418)
IC50 52000±n/a nM
Citation Bordeleau, MEMori, AOberer, MLindqvist, LChard, LSHiga, TBelsham, GJWagner, GTanaka, JPelletier, J Functional characterization of IRESes by an inhibitor of the RNA helicase eIF4A. Nat Chem Biol2:213-20 (2006) 
 
Eukaryotic initiation factor 4A-I
Name:Eukaryotic initiation factor 4A-I
Type:PROTEIN
Mol. Mass.:46146.87
Organism:Homo sapiens (Human)
Description:ChEMBL_864983
Residue:406
BDBM50482551
NameBDBM50482551
Synonyms:CHEMBL1222375 | Hippuristanol 3,11-Dione
TypeSmall organic molecule
Emp. Form.C28H42O5
Mol. Mass.458.6301
SMILES[H][C@]12C[C@@]3([H])[C@]4([H])CC[C@@]5([H])CC(=O)CC[C@]5(C)[C@@]4([H])C(=O)C[C@]3(C)[C@@]1([H])[C@@](C)(O)[C@]1(C[C@H](C)C(C)(C)O1)O2