Reaction Details
TargetEukaryotic initiation factor 4A-I
LigandBDBM50482558
Substrate/Competitorn/a
Meas. Tech.ChEMBL_653215 (CHEMBL1226418)
IC50 91000±n/a nM
Citation Bordeleau, MEMori, AOberer, MLindqvist, LChard, LSHiga, TBelsham, GJWagner, GTanaka, JPelletier, J Functional characterization of IRESes by an inhibitor of the RNA helicase eIF4A. Nat Chem Biol2:213-20 (2006) 
 
Eukaryotic initiation factor 4A-I
Name:Eukaryotic initiation factor 4A-I
Type:PROTEIN
Mol. Mass.:46146.87
Organism:Homo sapiens (Human)
Description:ChEMBL_864983
Residue:406
BDBM50482558
NameBDBM50482558
Synonyms:Hippuristanohemiacetal
TypeSmall organic molecule
Emp. Form.C30H46O7
Mol. Mass.518.682
SMILES[H][C@]12C[C@@]3([H])[C@]4([H])CC[C@@]5([H])C[C@@H](CC[C@]5(C)[C@@]4([H])[C@@H](O)C[C@@]33[C@H](O)O[C@](C)([C@@]13[H])[C@@]1(C[C@H](C)C(C)(C)O1)O2)OC(C)=O