Reaction Details
TargetPhenylethanolamine N-methyltransferase
LigandBDBM50028791
Substrate/Competitorn/a
Meas. Tech.ChEBML_152416
IC50 403000.0±n/a nM
Citation Vincek, WCAldrich, CSBorchardt, RTGrunewald, GL Importance of the aromatic ring in adrenergic amines. 5. Nonaromatic analogues of phenylethanolamine as inhibitors of phenylethanolamine N-methyltransferase: role of hydrophobic and steric interactions. J Med Chem24:7-12 (1981) Phenylethanolamine N-methyltransferase
Name:Phenylethanolamine N-methyltransferase
Type:Enzyme
Mol. Mass.:30916.97
Organism:Bos taurus (bovine)
Description:n/a
Residue:283
BDBM50028791
NameBDBM50028791
Synonyms:2,3-Dimethyl-pentanal | CHEMBL18278
TypeSmall organic molecule
Emp. Form.C7H14O
Mol. Mass.114.1855
SMILESCCC(C)C(C)C=O