Reaction Details
TargetPhenylethanolamine N-methyltransferase
LigandBDBM50028811
Substrate/Competitorn/a
Meas. Tech.ChEBML_152416
IC50 195000±n/a nM
Citation Vincek, WCAldrich, CSBorchardt, RTGrunewald, GL Importance of the aromatic ring in adrenergic amines. 5. Nonaromatic analogues of phenylethanolamine as inhibitors of phenylethanolamine N-methyltransferase: role of hydrophobic and steric interactions. J Med Chem24:7-12 (1981) Phenylethanolamine N-methyltransferase
Name:Phenylethanolamine N-methyltransferase
Type:Enzyme
Mol. Mass.:30916.97
Organism:Bos taurus (bovine)
Description:n/a
Residue:283
BDBM50028811
NameBDBM50028811
Synonyms:Adamantan-1-yl-trimethylsilanyloxy-acetonitrile | CHEMBL429382
TypeSmall organic molecule
Emp. Form.C15H25NOSi
Mol. Mass.263.4506
SMILESC[Si](C)(C)OC(C#N)C12CC3CC(CC(C3)C1)C2