Reaction Details
TargetPhenylethanolamine N-methyltransferase
LigandBDBM50028814
Substrate/Competitorn/a
Meas. Tech.ChEBML_152416
IC50 6000±n/a nM
Citation Vincek, WCAldrich, CSBorchardt, RTGrunewald, GL Importance of the aromatic ring in adrenergic amines. 5. Nonaromatic analogues of phenylethanolamine as inhibitors of phenylethanolamine N-methyltransferase: role of hydrophobic and steric interactions. J Med Chem24:7-12 (1981) Phenylethanolamine N-methyltransferase
Name:Phenylethanolamine N-methyltransferase
Type:Enzyme
Mol. Mass.:30916.97
Organism:Bos taurus (bovine)
Description:n/a
Residue:283
BDBM50028814
NameBDBM50028814
Synonyms:2-Amino-1-cyclononyl-ethanol | CHEMBL278978
TypeSmall organic molecule
Emp. Form.C11H23NO
Mol. Mass.185.3064
SMILESNCC(O)C1CCCCCCCC1