Reaction Details
TargetPhenylethanolamine N-methyltransferase
LigandBDBM50028834
Substrate/Competitorn/a
Meas. Tech.ChEBML_152416
IC50 72000±n/a nM
Citation Vincek, WCAldrich, CSBorchardt, RTGrunewald, GL Importance of the aromatic ring in adrenergic amines. 5. Nonaromatic analogues of phenylethanolamine as inhibitors of phenylethanolamine N-methyltransferase: role of hydrophobic and steric interactions. J Med Chem24:7-12 (1981) Phenylethanolamine N-methyltransferase
Name:Phenylethanolamine N-methyltransferase
Type:Enzyme
Mol. Mass.:30916.97
Organism:Bos taurus (bovine)
Description:n/a
Residue:283
BDBM50028834
NameBDBM50028834
Synonyms:1-Aminomethyl-cyclooctanol | CHEMBL19000
TypeSmall organic molecule
Emp. Form.C9H19NO
Mol. Mass.157.2533
SMILESNCC1(O)CCCCCCC1