Reaction Details
TargetPhenylethanolamine N-methyltransferase
LigandBDBM50028835
Substrate/Competitorn/a
Meas. Tech.ChEBML_152416
IC50 9000±n/a nM
Citation Vincek, WCAldrich, CSBorchardt, RTGrunewald, GL Importance of the aromatic ring in adrenergic amines. 5. Nonaromatic analogues of phenylethanolamine as inhibitors of phenylethanolamine N-methyltransferase: role of hydrophobic and steric interactions. J Med Chem24:7-12 (1981) Phenylethanolamine N-methyltransferase
Name:Phenylethanolamine N-methyltransferase
Type:Enzyme
Mol. Mass.:30916.97
Organism:Bos taurus (bovine)
Description:n/a
Residue:283
BDBM50028835
NameBDBM50028835
Synonyms:CHEMBL18302 | Cycloundecyl-trimethylsilanyloxy-acetonitrile
TypeSmall organic molecule
Emp. Form.C16H31NOSi
Mol. Mass.281.5089
SMILESC[Si](C)(C)OC(C#N)C1CCCCCCCCCC1