Reaction Details
TargetPeroxisome proliferator-activated receptor alpha/delta/gamma
LigandBDBM50484848
Substrate/Competitorn/a
Meas. Tech.ChEMBL_807162 (CHEMBL1959826)
EC50 12800±n/a nM
Citation Wang, HYan, JFSong, XLFan, LXu, JZhou, GMJiang, LYang, DC Synthesis and antidiabetic performance of ?-amino ketone containing nabumetone moiety. Bioorg Med Chem20:2119-30 (2012) 
 
Peroxisome proliferator-activated receptor alpha/delta/gamma
Name:Peroxisome proliferator-activated receptor alpha/delta/gamma
Synonyms:Peroxisome proliferator-activated receptor
Type:n/a
Mol. Mass.:n/a
Description:ASSAY_ID of ChEMBL is 807162
Components:This complex has 3 components.
Component 1
Name:Peroxisome proliferator-activated receptor gamma
Type:Nuclear Receptor
Mol. Mass.:57613.46
Organism:Homo sapiens (Human)
Description:P37231
Residue:505
Component 2
Name:Peroxisome proliferator-activated receptor alpha
Synonyms:NR1C1 PPAR PPAR-alpha PPARA_HUMAN Peroxisome proliferator-activated receptor | Peroxisome proliferator-activated receptor alpha (PPAR alpha)
Type:Enzyme
Mol. Mass.:52222.08
Organism:Homo sapiens (Human)
Description:Q07869
Residue:468
Component 3
Name:Peroxisome proliferator-activated receptor delta
Synonyms:NR1C2 NUCI Nuclear receptor subfamily 1 group C member 2 PPAR-beta PPARD Peroxisome proliferator-activated receptor Peroxisome proliferator-activated receptor delta
Type:Enzyme
Mol. Mass.:49910.45
Organism:Homo sapiens (Human)
Description:Q03181
Residue:441
BDBM50484848
NameBDBM50484848
Synonyms:CHEMBL1956027
TypeSmall organic molecule
Emp. Form.C28H27ClN2O4S
Mol. Mass.523.043
SMILESCOc1ccc2cc(CCC(=O)CC(Nc3ccc(cc3)S(N)(=O)=O)c3ccc(Cl)cc3)ccc2c1